{"text_format":"3","workbook":"xlsx","n_sheets":5,"sheets":["Input","Calc","Diagnose","Calc02","ProtoD"],"not_rendered":{"charts":7,"macros":1,"defined_names":5},"read":"whole","date_system":"1900"}

{"sheet":"Input","index":0,"n_rows":197,"n_cols":6,"rows_kept":197,"merged":[[0,0,0,1],[0,2,1,3],[0,4,1,5],[9,0,10,0],[9,1,10,1]]}
["Level of Understanding ",null,"Percieved Importance",null,"Level of Contact (approx. per week)"]
["L4","Analyze, theorize, hypothesize & justify (new) knowledge"]
["L3","Compare & explain theories ",3,"High",3,{"$f":"IF(OR(C8=Calc!L17, C8=Calc!L16, C8=Calc!L15), \"High (e.g. > = 5 Hours allocated)\", \"Many Hours (e.g. > 9 contact hours)\")","v":"High (e.g. > = 5 Hours allocated)"}]
["L2","Demonstrate comprehension & application of knowledge",2,"Medium",2,{"$f":"IF(OR(C8=Calc!L17, C8=Calc!L16, C8=Calc!L15), \"Medium (e.g. = 4 Hours allocated)\", \"Some Hours (e.g. 6-9 contact hours)\")","v":"Medium (e.g. = 4 Hours allocated)"}]
["L1","Recall knowledge, do simple procedures & calculations",1,"Low",1,{"$f":"IF(OR(C8=Calc!L17, C8=Calc!L16, C8=Calc!L15), \"Low (e.g. < = 3 Hours allocated)\", \"Few Hours (e.g. < 6 contact hours)\")","v":"Low (e.g. < = 3 Hours allocated)"}]
["L0","Not Applicable",0,"Not Applicable",0,"No hours allocated"]
[]
["Course/Subject",null,"Please Select"]
[]
["Item","Description","Level","Percieved Importance","Allocated Hours"]
[]
["TSkill01","Technology and applications used in the industry and on the field",{"$f":"IF(ISERROR(ROUND(AVERAGE(VALUE(RIGHT(C13:C15))),0)), \" \", CONCATENATE(\"L\", ROUND(AVERAGE(VALUE(RIGHT(C13:C15))),0)))","v":" "},{"$f":"IF(ISERROR(AVERAGE(D13:D15)), \" \", ROUND(AVERAGE(D13:D15),0))","v":" "}," ",{"$f":"IF(OR(C12=\" \", D12=\" \", E12=\" \", $C$8=Calc!$L$18,$C$8=Calc!$L$19), \"\", IFERROR(IF(OR(AND(VALUE(RIGHT(C12))>=3, OR(D12<=1, E12<=1)), AND(D12=3, OR(VALUE(RIGHT(C12))<2, E12<=1)), AND(E12=3, OR(VALUE(RIGHT(C12))<2, D12<=1))), \"ATTENTION REQUIRED\", \" \"), \" \"))","v":""}]
[null,"Use of technologies and applications within scope of work"]
[null,"Theories behind how and why certain equipment/technology is used to obtain results"]
[null,"Characteristics in different equipment used (tool & procedure)"]
{"$rows_left_out":183}
{"sheet":"Calc","index":1,"n_rows":30,"n_cols":16,"rows_kept":30,"hidden":true}
[null,null,"Perceived Importance","Contact Hours",null,"L1","L2","lowL","L3","L4","highL","avglvl"]
["SKILL"]
["TSkill","Technical Skill",{"$f":"(SUMIF(Input!A12:A1048576, \"=TSkill*\",Input!D12:D1048576)/(COUNTIF(Input!A:A, \"TSkill*\")*3))","v":{"v":0,"d":"0%"}},{"$f":"(SUMIF(Input!A12:A1048576, \"=TSkill*\",Input!E12:E1048576)/(COUNTIF(Input!A:A, \"TSkill*\")*3))","v":{"v":0,"d":"0%"}},null,{"$f":"COUNTIFS(Input!A12:A1048576, \"Tskill*\", Input!C12:C1048576, \"L1\")","v":0},{"$f":"COUNTIFS(Input!A12:A1048576, \"Tskill*\", Input!C12:C1048576, \"L2\")","v":0},{"$f":"SUM(COUNTIFS(Input!A12:A1048576, \"Tskill*\", Input!C12:C1048576, \"L1\"), COUNTIFS(Input!A12:A1048576, \"Tskill*\", Input!C12:C1048576, \"L2\"))","v":0},{"$f":"COUNTIFS(Input!A12:A1048576, \"Tskill*\", Input!C12:C1048576, \"L3\")","v":0},{"$f":"COUNTIFS(Input!A12:A1048576, \"Tskill*\", Input!C12:C1048576, \"L4\")","v":0},{"$f":"SUM(COUNTIFS(Input!A12:A1048576, \"Tskill*\", Input!C12:C1048576, \"L3\"), COUNTIFS(Input!A12:A1048576, \"Tskill*\", Input!C12:C1048576, \"L4\"))","v":0},{"$f":"ROUND(((F3*1)+(G3*2)+(I3*3)+(J3*4))/SUM(F3:G3,I3:J3),0)","v":{"$error":"#DIV/0!"}}]
["DGMSkill","Data Gathering & Manipulation Skill",{"$f":"(SUMIF(Input!A12:A1048576, \"=DGMSkill*\",Input!D12:D1048576)/(COUNTIF(Input!A:A, \"DGMSkill*\")*3))","v":{"v":0,"d":"0%"}},{"$f":"(SUMIF(Input!A12:A1048576, \"=DGMSkill*\",Input!E12:E1048576)/(COUNTIF(Input!A:A, \"DGMSkill*\")*3))","v":{"v":0,"d":"0%"}},null,{"$f":"COUNTIFS(Input!A12:A1048576, \"DGMSkill*\", Input!C12:C1048576, \"L1\")","v":0},{"$f":"COUNTIFS(Input!A12:A1048576, \"DGMSkill*\", Input!C12:C1048576, \"L2\")","v":0},{"$f":"SUM(COUNTIFS(Input!A12:A1048576, \"DGMSkill*\", Input!C12:C1048576, \"L1\"), COUNTIFS(Input!A12:A1048576, \"DGMSkill*\", Input!C12:C1048576, \"L2\"))","v":0},{"$f":"COUNTIFS(Input!A12:A1048576, \"DGMSkill*\", Input!C12:C1048576, \"L3\")","v":0},{"$f":"COUNTIFS(Input!A12:A1048576, \"DGMSkill*\", Input!C12:C1048576, \"L4\")","v":0},{"$f":"SUM(COUNTIFS(Input!A12:A1048576, \"DGMSkill*\", Input!C12:C1048576, \"L3\"), COUNTIFS(Input!A12:A1048576, \"DGMSkill*\", Input!C12:C1048576, \"L4\"))","v":0},{"$f":"ROUND(((F4*1)+(G4*2)+(I4*3)+(J4*4))/SUM(F4:G4,I4:J4),0)","v":{"$error":"#DIV/0!"}}]
["IMSkill","Imaging & Mapping Skill",{"$f":"(SUMIF(Input!A12:A1048576, \"=IMSkill*\",Input!D12:D1048576)/(COUNTIF(Input!A:A, \"IMSkill*\")*3))","v":{"v":0,"d":"0%"}},{"$f":"(SUMIF(Input!A12:A1048576, \"=IMSkill*\",Input!E12:E1048576)/(COUNTIF(Input!A:A, \"IMSkill*\")*3))","v":{"v":0,"d":"0%"}},null,{"$f":"COUNTIFS(Input!A12:A1048576, \"IMSkill*\", Input!C12:C1048576, \"L1\")","v":0},{"$f":"COUNTIFS(Input!A12:A1048576, \"IMSkill*\", Input!C12:C1048576, \"L2\")","v":0},{"$f":"SUM(COUNTIFS(Input!A12:A1048576, \"IMSkill*\", Input!C12:C1048576, \"L1\"), COUNTIFS(Input!A12:A1048576, \"IMSkill*\", Input!C12:C1048576, \"L2\"))","v":0},{"$f":"COUNTIFS(Input!A12:A1048576, \"IMSkill*\", Input!C12:C1048576, \"L3\")","v":0},{"$f":"COUNTIFS(Input!A12:A1048576, \"IMSkill*\", Input!C12:C1048576, \"L4\")","v":0},{"$f":"SUM(COUNTIFS(Input!A12:A1048576, \"IMSkill*\", Input!C12:C1048576, \"L3\"), COUNTIFS(Input!A12:A1048576, \"IMSkill*\", Input!C12:C1048576, \"L4\"))","v":0},{"$error":"#DIV/0!"}]
["SSkill","Spatial Skill",{"$f":"(SUMIF(Input!A12:A1048576, \"=SSkill*\",Input!D12:D1048576)/(COUNTIF(Input!A:A, \"SSkill*\")*3))","v":{"v":0,"d":"0%"}},{"$f":"(SUMIF(Input!A12:A1048576, \"=SSkill*\",Input!E12:E1048576)/(COUNTIF(Input!A:A, \"SSkill*\")*3))","v":{"v":0,"d":"0%"}},null,{"$f":"COUNTIFS(Input!A12:A1048576, \"SSkill*\", Input!C12:C1048576, \"L1\")","v":0},{"$f":"COUNTIFS(Input!A12:A1048576, \"SSkill*\", Input!C12:C1048576, \"L2\")","v":0},{"$f":"SUM(COUNTIFS(Input!A12:A1048576, \"SSkill*\", Input!C12:C1048576, \"L1\"), COUNTIFS(Input!A12:A1048576, \"SSkill*\", Input!C12:C1048576, \"L2\"))","v":0},{"$f":"COUNTIFS(Input!A12:A1048576, \"SSkill*\", Input!C12:C1048576, \"L3\")","v":0},{"$f":"COUNTIFS(Input!A12:A1048576, \"SSkill*\", Input!C12:C1048576, \"L4\")","v":0},{"$f":"SUM(COUNTIFS(Input!A12:A1048576, \"SSkill*\", Input!C12:C1048576, \"L3\"), COUNTIFS(Input!A12:A1048576, \"SSkill*\", Input!C12:C1048576, \"L4\"))","v":0},{"$error":"#DIV/0!"}]
["PSkill","Professional Skill",{"$f":"(SUMIF(Input!A12:A1048576, \"=PSkill*\",Input!D12:D1048576)/(COUNTIF(Input!A:A, \"PSkill*\")*3))","v":{"v":0,"d":"0%"}},{"$f":"(SUMIF(Input!A12:A1048576, \"=PSkill*\",Input!E12:E1048576)/(COUNTIF(Input!A:A, \"PSkill*\")*3))","v":{"v":0,"d":"0%"}},null,{"$f":"COUNTIFS(Input!A12:A1048576, \"PSkill*\", Input!C12:C1048576, \"L1\")","v":0},{"$f":"COUNTIFS(Input!A12:A1048576, \"PSkill*\", Input!C12:C1048576, \"L2\")","v":0},{"$f":"SUM(COUNTIFS(Input!A12:A1048576, \"PSkill*\", Input!C12:C1048576, \"L1\"), COUNTIFS(Input!A12:A1048576, \"PSkill*\", Input!C12:C1048576, \"L2\"))","v":0},{"$f":"COUNTIFS(Input!A12:A1048576, \"PSkill*\", Input!C12:C1048576, \"L3\")","v":0},{"$f":"COUNTIFS(Input!A12:A1048576, \"PSkill*\", Input!C12:C1048576, \"L4\")","v":0},{"$f":"SUM(COUNTIFS(Input!A12:A1048576, \"PSkill*\", Input!C12:C1048576, \"L3\"), COUNTIFS(Input!A12:A1048576, \"PSkill*\", Input!C12:C1048576, \"L4\"))","v":0},{"$error":"#DIV/0!"}]
[null,"Application Skill",{"$f":"(SUMIF(Input!A12:A1048576, \"=ASkill*\",Input!D12:D1048576)/(COUNTIF(Input!A:A, \"ASkill*\")*3))","v":{"v":0,"d":"0%"}},{"$f":"(SUMIF(Input!A12:A1048576, \"=ASkill*\",Input!E12:E1048576)/(COUNTIF(Input!A:A, \"ASkill*\")*3))","v":{"v":0,"d":"0%"}},null,{"$f":"COUNTIFS(Input!A12:A1048576, \"ASkill*\", Input!C12:C1048576, \"L1\")","v":0},{"$f":"COUNTIFS(Input!A12:A1048576, \"ASkill*\", Input!C12:C1048576, \"L2\")","v":0},{"$f":"SUM(COUNTIFS(Input!A12:A1048576, \"ASkill*\", Input!C12:C1048576, \"L1\"), COUNTIFS(Input!A12:A1048576, \"ASkill*\", Input!C12:C1048576, \"L2\"))","v":0},{"$f":"COUNTIFS(Input!A12:A1048576, \"ASkill*\", Input!C12:C1048576, \"L3\")","v":0},{"$f":"COUNTIFS(Input!A12:A1048576, \"ASkill*\", Input!C12:C1048576, \"L4\")","v":0},{"$f":"SUM(COUNTIFS(Input!A12:A1048576, \"ASkill*\", Input!C12:C1048576, \"L3\"), COUNTIFS(Input!A12:A1048576, \"ASkill*\", Input!C12:C1048576, \"L4\"))","v":0},{"$error":"#DIV/0!"}]
["KNOWLEDGE",{"$nulls":11},"L1","L2","L3","L4"]
["Bkno","Basic Knowledge",{"$f":"(SUMIF(Input!A12:A1048576, \"=BKno*\",Input!D12:D1048576)/(COUNTIF(Input!A:A, \"BKno*\")*3))","v":{"v":0,"d":"0%"}},{"$f":"(SUMIF(Input!A12:A1048576, \"=BKno*\",Input!E12:E1048576)/(COUNTIF(Input!A:A, \"BKno*\")*3))","v":{"v":0,"d":"0%"}},null,{"$f":"COUNTIFS(Input!A12:A1048576, \"BKno*\", Input!C12:C1048576, \"L1\")","v":0},{"$f":"COUNTIFS(Input!A12:A1048576, \"BKno*\", Input!C12:C1048576, \"L2\")","v":0},{"$f":"SUM(COUNTIFS(Input!A12:A1048576, \"BKno*\", Input!C12:C1048576, \"L1\"), COUNTIFS(Input!A12:A1048576, \"BKno*\", Input!C12:C1048576, \"L2\"))","v":0},{"$f":"COUNTIFS(Input!A12:A1048576, \"BKno*\", Input!C12:C1048576, \"L3\")","v":0},{"$f":"COUNTIFS(Input!A12:A1048576, \"BKno*\", Input!C12:C1048576, \"L4\")","v":0},{"$f":"SUM(COUNTIFS(Input!A12:A1048576, \"BKno*\", Input!C12:C1048576, \"L3\"), COUNTIFS(Input!A12:A1048576, \"BKno*\", Input!C12:C1048576, \"L4\"))","v":0},null,{"$f":"F10/SUM(F10:G10,I10:J10)","v":{"$error":"#DIV/0!"}},{"$f":"G10/SUM(F10:G10,I10:J10)","v":{"$error":"#DIV/0!"}},{"$f":"I10/SUM(F10:G10,I10:J10)","v":{"$error":"#DIV/0!"}},{"$f":"J10/SUM(F10:G10,I10:J10)","v":{"$error":"#DIV/0!"}}]
["SupKno","Supplementary Knowledge",{"$f":"(SUMIF(Input!A12:A1048576, \"=SupKno*\",Input!D12:D1048576)/(COUNTIF(Input!A:A, \"SupKno*\")*3))","v":{"v":0,"d":"0%"}},{"$f":"(SUMIF(Input!A12:A1048576, \"=SupKno*\",Input!E12:E1048576)/(COUNTIF(Input!A:A, \"SupKno*\")*3))","v":{"v":0,"d":"0%"}},null,{"$f":"COUNTIFS(Input!A12:A1048576, \"SupKno*\", Input!C12:C1048576, \"L1\")","v":0},{"$f":"COUNTIFS(Input!A12:A1048576, \"SupKno*\", Input!C12:C1048576, \"L2\")","v":0},{"$f":"SUM(COUNTIFS(Input!A12:A1048576, \"SupKno*\", Input!C12:C1048576, \"L1\"), COUNTIFS(Input!A12:A1048576, \"SupKno*\", Input!C12:C1048576, \"L2\"))","v":0},{"$f":"COUNTIFS(Input!A12:A1048576, \"SupKno*\", Input!C12:C1048576, \"L3\")","v":0},{"$f":"COUNTIFS(Input!A12:A1048576, \"SupKno*\", Input!C12:C1048576, \"L4\")","v":0},{"$f":"SUM(COUNTIFS(Input!A12:A1048576, \"SupKno*\", Input!C12:C1048576, \"L3\"), COUNTIFS(Input!A12:A1048576, \"SupKno*\", Input!C12:C1048576, \"L4\"))","v":0},null,{"$f":"F11/SUM(F11:G11,I11:J11)","v":{"$error":"#DIV/0!"}},{"$f":"G11/SUM(F11:G11,I11:J11)","v":{"$error":"#DIV/0!"}},{"$f":"I11/SUM(F11:G11,I11:J11)","v":{"$error":"#DIV/0!"}},{"$f":"J11/SUM(F11:G11,I11:J11)","v":{"$error":"#DIV/0!"}}]
["SpKno","Specialized Knowledge",{"$f":"(SUMIF(Input!A12:A1048576, \"=SPKno*\",Input!D12:D1048576)/(COUNTIF(Input!A:A, \"SPKno*\")*3))","v":{"v":0,"d":"0%"}},{"$f":"(SUMIF(Input!A12:A1048576, \"=SpKno*\",Input!E12:E1048576)/(COUNTIF(Input!A:A, \"SpKno*\")*3))","v":{"v":0,"d":"0%"}},null,{"$f":"COUNTIFS(Input!A12:A1048576, \"SpKno*\", Input!C12:C1048576, \"L1\")","v":0},{"$f":"COUNTIFS(Input!A12:A1048576, \"SpKno*\", Input!C12:C1048576, \"L2\")","v":0},{"$f":"SUM(COUNTIFS(Input!A12:A1048576, \"SpKno*\", Input!C12:C1048576, \"L1\"), COUNTIFS(Input!A12:A1048576, \"SpKno\", Input!C12:C1048576, \"L2\"))","v":0},{"$f":"COUNTIFS(Input!A12:A1048576, \"SpKno*\", Input!C12:C1048576, \"L3\")","v":0},{"$f":"COUNTIFS(Input!A12:A1048576, \"SpKno*\", Input!C12:C1048576, \"L4\")","v":0},{"$f":"SUM(COUNTIFS(Input!A12:A1048576, \"SpKno*\", Input!C12:C1048576, \"L3\"), COUNTIFS(Input!A12:A1048576, \"SpKno\", Input!C12:C1048576, \"L4\"))","v":0},null,{"$error":"#DIV/0!"},{"$error":"#DIV/0!"},{"$error":"#DIV/0!"},{"$error":"#DIV/0!"}]
[{"$nulls":7},{"$f":"SUM(H3:H12)","v":0},null,null,{"$f":"SUM(K3:K12)","v":0}]
["KNOWLEDGE",null,"Percieve","Contact","Count (Imp)"]
["BKnoMIV","Basic Knowledge (Mapping & Image Visualization)",{"$nulls":4},"Level","count","%",null,null,"Please Select"]
{"$rows_left_out":16}
{"sheet":"Diagnose","index":2,"n_rows":27,"n_cols":15,"rows_kept":27,"merged":[[1,4,1,14],[16,1,16,14],[26,1,26,14]]}
[]
[null,{"$f":"IF(Input!C8=\"Please Select\", \"Subject/Course\", IF(Input!C8=\"Topic\", Calc!L16, IF(Input!C8=\"Subject\", Calc!L17, IF(Input!C8=\"Course\",Calc!L18, IF(Input!C8=\"Programme\", Calc!L19, \" \")))))","v":"Subject/Course"},null,null,"Taught Knowledge"]
[null,{"$f":"IF(ISBLANK(Input!B8), \"-\", Input!B8)","v":"-"}]
[]
[null,"Average Level of Understanding"]
[null,{"$f":"IF(SUM(Calc!H16:H19) = 0, \"N/A\", IF(AND(SUM(Calc!H18:H19)>SUM(Calc!H17:H18),SUM(Calc!H18:H19)>SUM(Calc!H16:H17)), \"Advance\", IF(AND(SUM(Calc!H17:H18)>SUM(Calc!H18:H19), SUM(Calc!H17:H18)>SUM(Calc!H16:H17)), \"Intermediate\", \"Introductory\")))","v":"N/A"}]
[]
[null,"Specialisation Focus"]
[null,{"$f":"IF(SUM(Calc!E24:E30)=0,\"N/A\",IF(AND(Calc!E24<0.2,Calc!E25<0.2,Calc!E26<0.2,Calc!E27<0.2,Calc!E28<0.2,Calc!E29<0.2,Calc!E30<0.2),\"Broad\",VLOOKUP(INDEX(Calc!A24:A30,MATCH(MAX(Calc!E24:E30),Calc!E24:E30,0)),Calc!A24:E30,2,0)))","v":"N/A"}]
[]
[null,"Supplementary Focus"]
[null,{"$f":"IF(SUM(Calc!E21:E23)=0,\"NIL\",IF(AND(Calc!E21=Calc!E22,Calc!E22=Calc!E23,Calc!E23=Calc!E21),\"None\",IF(AND(Calc!E21>Calc!E23,Calc!E21=Calc!E22),\"Construction, Building & Environment\",IF(AND(Calc!E22>Calc!E21,Calc!E22=Calc!E23),\"Environment & Social\",IF(AND(Calc!E23>Calc!E22,Calc!E23=Calc!E21),\"Construction, Building & Social\",VLOOKUP(INDEX(Calc!A21:A23,MATCH(MAX(Calc!E21:E23),Calc!E21:E23,0)),Calc!A21:E23,2,0))))))","v":"NIL"}]
[]
[null,"Comment"]
[null,{"$f":"IF(OR(Input!C8=Calc!L17, Input!C8=Calc!L16, Input!C8=Calc!L15), CONCATENATE(COUNTIF(Input!F12:F1048576, \"ATTENTION REQUIRED\"), \" items require attention (more contact hours).\",CHAR(10), CHAR(10),IF(AND(Diagnose!B6=\"Advance\", NOT(Diagnose!B6=\"Introductory\"), NOT(Diagnose!B6=\"Intermediate\")), \"Course focus on Analyzing, Theorizing and Justifying (new) Knowledge\", IF(AND(Diagnose!B6=\"Intermediate\", NOT(Diagnose!B6=\"Advance\"), NOT(Diagnose!B6=\"Introductory\")), \"Course focus on Knowledge, Application and Comprehension of theories\", IF(AND(B6=\"Introductory\",NOT(B6=\"Advance\"),NOT(B6=\"Intermediate\")),\"Course focus on Knowledge Recall and Simple Calculations\",\" \")))), IF(AND(Diagnose!B6=\"Advance\", NOT(Diagnose!B6=\"Introductory\"), NOT(Diagnose!B6=\"Intermediate\")), \"Course focus on Analyzing, Theorizing and Justifying (new) Knowledge\", IF(AND(Diagnose!B6=\"Intermediate\", NOT(Diagnose!B6=\"Advance\"), NOT(Diagnose!B6=\"Introductory\")), \"Course focus on Knowledge, Application and Comprehension of theories\", IF(AND(B6=\"Introductory\",NOT(B6=\"Advance\"),NOT(B6=\"Intermediate\")),\"Course focus on Knowledge Recall and Simple Calculations\",\" \"))))","v":"0 items require attention (more contact hours).\n\n "}]
{"$rows_left_out":13}
{"sheet":"Calc02","index":3,"n_rows":120,"n_cols":18,"rows_kept":120,"hidden":true}
["C/P",null,"Level","Perceived","Contact","Point",null,null,"Skills","Percieved","Contact",null,null,"Conceptual/Analytical"]
["P",{"$f":"Input!A12","v":"TSkill01"},{"$f":"Input!C12","v":" "},{"$f":"Input!D12","v":" "},{"$f":"Input!E12","v":" "},{"$f":"IFERROR(RIGHT(C2)+D2+E2,0)","v":0},null,null,"Technical",{"$f":"SUM(D2:D3)","v":0},{"$f":"SUM(E2:E3)","v":0},{"$f":"COUNTIF(B:B,\"Tskill*\")*3","v":6},null,"Count >6","max","%"]
["C",{"$f":"Input!A16","v":"TSkill02"},{"$f":"Input!C16","v":" "},{"$f":"Input!D16","v":" "},{"$f":"Input!E16","v":" "},{"$f":"IFERROR(RIGHT(C3)+D3+E3,0)","v":0},null,null,"Data Gathering",{"$f":"SUM(D4:D7)","v":0},{"$f":"SUM(E4:E7)","v":0},{"$f":"COUNTIF(B:B,\"DGMSkill*\")*3","v":12},null,{"$f":"COUNTIFS(A2:A120, \"=C\", Point, \">=6\")","v":0},{"$f":"COUNTIFS(A2:A120,\"=C\",Point,\"<>0\")","v":0},{"$f":"IFERROR(N3/O3,0)","v":0}]
["P",{"$f":"Input!A21","v":"DGMSkill01"},{"$f":"Input!C21","v":" "},{"$f":"Input!D21","v":" "},{"$f":"Input!E21","v":" "},0,null,null,"Imaging",{"$f":"SUM(D8:D10)","v":0},{"$f":"SUM(E8:E10)","v":0},{"$f":"COUNTIF(B:B,\"IMSkill*\")*3","v":9},{"$nulls":4},"Diff","Sum"]
["P",{"$f":"Input!A25","v":"DGMSkill02"},{"$f":"Input!C25","v":" "},{"$f":"Input!D25","v":" "},{"$f":"Input!E25","v":" "},0,null,null,"Spatial",{"$f":"SUM(D11:D13)","v":0},{"$f":"SUM(E11:E13)","v":0},{"$f":"COUNTIF(B:B,\"Sskill*\")*3","v":9},null,"Practical/Technical",null,null,{"$f":"(P7*R5)-(P3*R5)","v":0},{"$f":"O7+O3","v":0}]
["P",{"$f":"Input!A28","v":"DGMSkill03"},{"$f":"Input!C28","v":" "},{"$f":"Input!D28","v":" "},{"$f":"Input!E28","v":" "},0,null,null,"Professional",{"$f":"SUM(D14:D17)","v":0},{"$f":"SUM(E14:E17)","v":0},{"$f":"COUNTIF(B:B,\"Pskill*\")*3","v":12},null,"Count>6","max","%"]
["P",{"$f":"Input!A31","v":"DGMSkill04"},{"$f":"Input!C31","v":" "},{"$f":"Input!D31","v":" "},{"$f":"Input!E31","v":" "},0,null,null,"Application",{"$f":"SUM(D18:D19)","v":0},{"$f":"SUM(E18:E19)","v":0},{"$f":"COUNTIF(B:B,\"Askill*\")*3","v":6},null,{"$f":"COUNTIFS(A2:A120, \"=p\", Point, \">=6\")","v":0},{"$f":"COUNTIFS(A2:A120, \"=p\", Point, \">=6\")","v":0},{"$f":"IFERROR(N7/O7,0)","v":0}]
["C",{"$f":"Input!A35","v":"IMSkill01"},{"$f":"Input!C35","v":" "},{"$f":"Input!D35","v":" "},{"$f":"Input!E35","v":" "},0]
["C",{"$f":"Input!A39","v":"IMSkill02"},{"$f":"Input!C39","v":" "},{"$f":"Input!D39","v":" "},{"$f":"Input!E39","v":" "},0,{"$nulls":3},"%Spec+ve","%slider fill p","%sliderp size","Standard","Slider Position P","Spectrum","Slider Fill P","Slider Size"]
["C",{"$f":"Input!A42","v":"IMSkill03"},{"$f":"Input!C42","v":" "},{"$f":"Input!D42","v":" "},{"$f":"Input!E42","v":" "},0,null,"per",{"$f":"Calc!B3","v":"Technical Skill"},1,{"$f":"IF(AND(N10=0,N11=0),0.485,P10/O10)","v":0.485},0.015,0.015,{"$f":"J2","v":0},{"$f":"L2","v":6},{"$f":"N10-Q10","v":-0.09},{"$f":"O10*M10","v":0.09}]
[null,{"$f":"Input!A46","v":"SSkill01"},{"$f":"Input!C46","v":" "},{"$f":"Input!D46","v":" "},{"$f":"Input!E46","v":" "},0,null,"con",null,1,{"$f":"IF(AND(N11=0,N10=0),0.485,P11/O11)","v":0.485},0.015,0.015,{"$f":"K2","v":0},{"$f":"L2","v":6},{"$f":"N11-Q10","v":-0.09},{"$f":"O11*M11","v":0.09}]
[null,{"$f":"Input!A49","v":"SSkill02"},{"$f":"Input!C49","v":" "},{"$f":"Input!D49","v":" "},{"$f":"Input!E49","v":" "},0]
[null,{"$f":"Input!A52","v":"SSkill03"},{"$f":"Input!C52","v":" "},{"$f":"Input!D52","v":" "},{"$f":"Input!E52","v":" "},0,null,"per",{"$f":"Calc!B4","v":"Data Gathering & Manipulation Skill"},1,{"$f":"IF(AND(N13=0,N14=0),0.485,P13/O13)","v":0.485},0.015,0.015,{"$f":"J3","v":0},{"$f":"L3","v":12},{"$f":"N13-Q13","v":-0.18},{"$f":"O13*M13","v":0.18}]
[null,{"$f":"Input!A55","v":"PSkill01"},{"$f":"Input!C55","v":" "},{"$f":"Input!D55","v":" "},{"$f":"Input!E55","v":" "},0,null,"con",null,1,{"$f":"IF(AND(N13=0,N14=0),0.485,P14/O14)","v":0.485},0.015,0.015,{"$f":"K3","v":0},{"$f":"L3","v":12},{"$f":"N14-Q13","v":-0.18},{"$f":"O14*M14","v":0.18}]
[null,{"$f":"Input!A59","v":"PSkill02"},{"$f":"Input!C59","v":" "},{"$f":"Input!D59","v":" "},{"$f":"Input!E59","v":" "},0]
{"$rows_left_out":106}
{"sheet":"ProtoD","index":4,"n_rows":46,"n_cols":14,"rows_kept":46,"hidden":true}
{"$rows_empty":17}
[{"$nulls":9},{"$f":"IF(Input!C8=\"Please Select\", \"Subject/Course\", IF(Input!C8=\"Topic\", Calc!L16, IF(Input!C8=\"Subject\", Calc!L17, IF(Input!C8=\"Course\",Calc!L18, IF(Input!C8=\"Programme\", Calc!L19, \" \")))))","v":"Subject/Course"}]
[{"$nulls":9},{"$f":"IF(ISBLANK(Input!B8), \"-\", Input!B8)","v":"-"}]
[]
[{"$nulls":9},"Diagnosed Level",null,null,{"$f":"IF(OR(J18=Calc!L17,J18=Calc!L16, J18=\"Subject/Course\"),\"Specialization Focus\",\" \")","v":"Specialization Focus"}]
[{"$nulls":9},{"$f":"IF(SUM(Calc!H16:H19) = 0, \"N/A\", IF(AND(SUM(Calc!H18:H19)>SUM(Calc!H17:H18),SUM(Calc!H18:H19)>SUM(Calc!H16:H17)), \"Advance\", IF(AND(SUM(Calc!H17:H18)>SUM(Calc!H18:H19), SUM(Calc!H17:H18)>SUM(Calc!H16:H17)), \"Intermediate\", \"Introductory\")))","v":"N/A"},null,null,{"$f":"IF(OR(J18=Calc!L17, J18=Calc!L16, J18=\"Subject/Course\"), IF(SUM(Calc!E24:E30)=0,\"N/A\",IF(AND(Calc!E24<0.2,Calc!E25<0.2,Calc!E26<0.2,Calc!E27<0.2,Calc!E28<0.2,Calc!E29<0.2,Calc!E30<0.2),\"Broad\",VLOOKUP(INDEX(Calc!A23:A29,MATCH(MAX(Calc!E24:E30),Calc!E24:E30,0)),Calc!A23:F29,2,0))),\" \")","v":"N/A"}]
[{"$nulls":9},{"$f":"IF(OR(J18=Calc!L17,J18=Calc!L16, J18=\"Subject/Course\"),\" \", IF(AND(J22=\"Advance\", NOT(J22=\"Introductory\"), NOT(J22=\"Intermediate\")), \"Course focus on Analyzing, Theorizing and Justifying (new) Knowledge\", IF(AND(J22=\"Intermediate\", NOT(J22=\"Advance\"), NOT(J22=\"Introductory\")), \"Course focus on Knowledge, Application and Comprehension of theories\", \"Course focus on Knowledge Recall and Simple Calculations\")))","v":" "}]
[{"$nulls":12},{"$f":"IF(OR(J18=Calc!L17,J18=Calc!L16, J18=\"Subject/Course\"),\"Supplementary Focus\",\" \")","v":"Supplementary Focus"}]
[{"$nulls":12},{"$f":"IF(OR(J18=Calc!L17,J18=Calc!L16, J18=\"Subject/Course\"),IF(SUM(Calc!E21:E23)=0,\"NIL\",IF(AND(Calc!E21=Calc!E22,Calc!E22=Calc!E23,Calc!E23=Calc!E21),\"None\",IF(AND(Calc!E21>Calc!E23,Calc!E21=Calc!E22),\"Construction, Building & Environment\",IF(AND(Calc!E22>Calc!E21,Calc!E22=Calc!E23),\"Environment & Social\",IF(AND(Calc!E23>Calc!E22,Calc!E23=Calc!E21),\"Construction, Building & Social\",VLOOKUP(INDEX(Calc!A20:A22,MATCH(MAX(Calc!E21:E23),Calc!E21:E23,0)),Calc!A20:F22,2,0)))))),\" \")","v":"NIL"}]
[{"$nulls":9},{"$f":"IF(OR(J18=Calc!L16, J18=Calc!L17,J18=\"Subject/Course\"), \"Comment\", \"Details\")","v":"Comment"}]
[{"$nulls":9},{"$f":"IF(OR(J18=Calc!L17, J18=Calc!L16, J18=\"Subject/Course\"), CONCATENATE(COUNTIF(Input!F12:F1048576, \"IMBALANCE\"), \" items of imbalanced nature.\"), \"Breakdown of Levels\")","v":"0 items of imbalanced nature."}]
[{"$nulls":9},{"$f":"IF(OR(J18=Calc!L17, J18=Calc!L16, J18=\"Subject/Course\"), CONCATENATE(COUNTIF(Input!F12:F1048576, \"ATTENTION REQUIRED\"), \" items require attention (more contact hours).\"), \" \")","v":"0 items require attention (more contact hours)."}]
[{"$nulls":10},{"$f":"IF(OR(J18=Calc!L17,J18=Calc!L16, J18=\"Subject/Course\"),\" \",\"Level 1\")","v":" "},{"$f":"IF(OR(J18=Calc!L17,J18=Calc!L16, J18=\"Subject/Course\"),\" \",\"Level 2\")","v":" "},{"$f":"IF(OR(J18=Calc!L17,J18=Calc!L16, J18=\"Subject/Course\"),\" \",\"Level 3\")","v":" "},{"$f":"IF(OR(J18=Calc!L17,J18=Calc!L16, J18=\"Subject/Course\"),\" \",\"Level 4\")","v":" "}]
[{"$nulls":9},{"$f":"IF(OR(J18=Calc!L17,J18=Calc!L16, J18=\"Subject/Course\"),\" \",\"# of Items\")","v":" "},{"$f":"IF(OR(J18=Calc!L17,J18=Calc!L16, J18=\"Subject/Course\"),\" \",Calc!H16)","v":" "},{"$f":"IF(OR(J18=Calc!L17,J18=Calc!L16,J18=\"Subject/Course\"),\" \",Calc!H17)","v":" "},{"$f":"IF(OR(J18=Calc!L17,J18=Calc!L16, J18=\"Subject/Course\"),\" \",Calc!H18)","v":" "},{"$f":"IF(OR(J18=Calc!L17,J18=Calc!L16, J18=\"Subject/Course\"),\" \",Calc!H19)","v":" "}]
[]
{"$rows_left_out":15}