{"text_format":"3","workbook":"xlsx","n_sheets":5,"sheets":["Input","List","ICalc01","ICalc02","OutputDiagnosis"],"not_rendered":{"charts":6,"macros":1,"defined_names":42},"read":"whole","date_system":"1900"}

{"sheet":"Input","index":0,"n_rows":251,"n_cols":12,"rows_kept":251,"merged":[[6,2,7,2],[6,3,7,3],[6,5,7,8]]}
["Expected Level of Understanding ",{"$nulls":3},"Perceived Importance",null,"Level of Contact"]
["L4","Analyze, theorize, hypothesize & justify (new) knowledge",null,null,3,"High",3,"High amount of contact"]
["L3","Compare & explain theories ",null,null,2,"Medium",2,"Average amount of contact"]
["L2","Demonstrate comphrehension & application of knowledge",null,null,1,"Low",1,"Minimum amount of contact"]
["L1","Recall knowledge, do simple procedures & calculations",null,null,0,"N/A",0,"No contact"]
[]
{"$rows_left_out":246}
{"sheet":"List","index":1,"n_rows":19,"n_cols":25,"rows_kept":19,"hidden":true}
["Rank","Foundation","Core","Specialised","Earth","CoordinateSystems","OurPlace","MapReading","Database","Math","Physics","Geography","DataAcquisitionConcepts","DataUse","Geographical Data Structure","SpatialAnalysis","GeospatialToolbox","DataVisualization","MapMaking","General Application","Professionalism","DataAcquisitionMethods","Programming","ProjectManagement","AdvancedApplications"]
["Foundation","Earth","DataAcquisitionConcepts","DataAcquisitionMethods","Physical","Direction","Geographical Features","Map Comprehension","Data Format & Type","Geometry","Electromagnetic Wave","Climate/ Meteorology","Gathering Data","Data Adjustment","Geographical Database","Spatial Relationships","GIS","Cartography","2D & 3D Maps","Environmental Applications","Industry & Institutional Standards","Land Surveying","Program Structure","Risk Management","Geography & Geographical Analysis"]
["Core","CoordinateSystems","DataUse","Programming","Model","Unit","Demographics","Map Interpretation","Data Structure","Algebra","Wave Propagation, Characteristics & Properties","Geomorphology","Quality of Data","Data Management","Spatial Data Representation","Spatial Data Topology","CAD","Computer Visualization/ Display","Perception Theory","Social Applications","Morals & Ethics","Remote Sensing","Systems Design","Programme Management","Social Science & Demographical Analysis"]
["Specialised","OurPlace","GeographicalDataStructure","ProjectManagement","Others","Scale","Rural & Urban Geography","Others","Data Models & Database","Trigonometry","Optics/Propertis of Light","Landscape Ecology","Data Manipulation","Numerical Analysis","Map Indexing","Spatial Data Modelling","Program Customization","Others","Mapping Techniques","Urban Applications","Legal & Social Responsibilities","Photogrammetry","Systems Development","Business Management","Humanities (Arts & History Visualization)"]
[null,"MapReading","SpatialAnalysis","AdvancedApplications",null,"Transformation","Others",null,"Others","Statistics","Astronomy/Astrometry","Human Geography","Collected Data Types","Others","Others","Spatial Interaction","Geospatial Technology & Hardware",null,"Others","Others","Inter-relationships","GNSS/GPS","CASE Tools","Resource Management","Economics & Economical Modelling"]
[null,"Database","GeospatialToolbox",null,null,"Others",{"$nulls":3},"Numbers, Functions & Operations","Acoustics","Others","Others",null,null,"Others","Others",{"$nulls":3},"Decision Making & Support","Underground Surveying","Others","Team Management","Earth Science & Geological Analysis"]
{"$rows_left_out":14}
{"sheet":"ICalc01","index":2,"n_rows":136,"n_cols":60,"rows_kept":136,"hidden":true,"merged":[[0,0,1,0],[0,1,1,1],[0,2,1,2],[0,6,0,11],[0,12,0,17],[0,18,0,21],[0,22,0,25],[0,26,0,31],[0,32,1,32],[0,33,1,33],[0,34,1,34],[0,35,1,35],[0,36,0,41],[0,42,0,47],[0,48,0,53],[0,54,0,57],[0,58,1,58],[0,59,1,59],[2,3,4,3],[2,36,41,36],[2,37,41,37],[2,38,41,38],[2,39,41,39],[2,40,41,40],[2,41,41,41],[2,42,41,42],[2,43,41,43],[2,44,41,44],[2,45,41,45],[2,46,41,46],[2,47,41,47],[2,48,41,48],[2,49,41,49],[2,50,41,50],[2,51,41,51],[2,52,41,52],[2,53,41,53],[2,54,41,54],[2,55,41,55],[2,56,41,56],[2,57,41,57],[2,58,41,58],[2,59,41,59],[5,3,9,3],[10,3,13,3],[14,3,16,3],[17,3,20,3],[21,3,28,3],[29,3,36,3],[37,3,41,3],[42,3,46,3],[42,36,84,36],[42,37,84,37],[42,38,84,38],[42,39,84,39],[42,40,84,40],[42,41,84,41],[42,42,84,42],[42,43,84,43],[42,44,84,44],[42,45,84,45],[42,46,84,46],[42,47,84,47],[42,48,84,48],[42,49,84,49],[42,50,84,50],[42,51,84,51],[42,52,84,52],[42,53,84,53],[42,54,84,54],[42,55,84,55],[42,56,84,56],[42,57,84,57],[42,58,84,58],[42,59,84,59],[47,3,50,3],[51,3,54,3],[55,3,59,3],[60,3,64,3],[65,3,67,3],[68,3,71,3],[72,3,75,3],[76,3,84,3],[85,3,91,3],[85,36,111,36],[85,37,111,37],[85,38,111,38],[85,39,111,39],[85,40,111,40],[85,41,111,41],[85,42,111,42],[85,43,111,43],[85,44,111,44],[85,45,111,45],[85,46,111,46],[85,47,111,47],[85,48,111,48],[85,49,111,49],[85,50,111,50],[85,51,111,51],[85,52,111,52],[85,53,111,53],[85,54,111,54],[85,55,111,55],[85,56,111,56],[85,57,111,57],[85,58,111,58],[85,59,111,59],[92,3,96,3],[97,3,103,3],[104,3,111,3],[113,3,113,5]]}
["F/ C/ S","T/U","Geo / Gen",{"$nulls":3},"Taught Count Frequency",{"$nulls":5},"Taught Hours",{"$nulls":5},"Perceived Level Frequency",{"$nulls":3},"Importance Count",{"$nulls":3},"Skill Set Count",{"$nulls":5},"Sum Taught Count","Sum Taught Hrs","Avg Importance Rate","Avg Taught Hrs ","Rank Taught Frequency",{"$nulls":5},"Rank Taught Hrs",{"$nulls":5},"Area Skills Frequency",{"$nulls":9},"Rank Taught Frequency Total","Rank Taught Hrs Total"]
[{"$nulls":3},"Rank","Area","Topic","Independent Learning/ Research","Interactive Learning/ Social Interaction","Instructive Teaching","Field/ Hands-on Experience","Online Learning/ Case Studies","Others","Independent Learning/ Research","Interactive Learning/ Social Interaction","Instructive Teaching","Field/ Hands-on Experience","Online Learning/ Case Studies","Others","L1","L2","L3","L4",0,1,2,3,"Data Gathering & Manipulation Skills","Imaging, Mapping & Visualization Skills","Professional, Collaboration & Cooperation Skills","Spatial Skills","Technical & Practical (Hands-on) Skills","Others",{"$nulls":4},"Independent Learning/ Research","Interactive Learning/ Social Interaction","Instructive Teaching","Field/ Hands-on Experience","Online Learning/ Case Studies","Others","Independent Learning/ Research","Interactive Learning/ Social Interaction","Instructive Teaching","Field/ Hands-on Experience","Online Learning/ Case Studies","Others","Data Gathering & Manipulation Skills","Imaging, Mapping & Visualization Skills","Professional, Collaboration & Cooperation Skills","Spatial Skills","Technical & Practical (Hands-on) Skills","Others","L1","L2","L3","L4"]
["F","T U","Geo","FOUNDATION","Earth","Physical",{"$f":"COUNTIFS(InputArea,\"=\"&List!$B$2,InputTopic,\"=\"&List!$E2,InputMode,\"=\"&List!$A$14)","v":0},{"$f":"COUNTIFS(InputArea,\"=\"&List!$B$2,InputTopic,\"=\"&List!$E2,InputMode,\"=\"&List!$A$15)","v":0},{"$f":"COUNTIFS(InputArea,\"=\"&List!$B$2,InputTopic,\"=\"&List!$E2,InputMode,\"=\"&List!$A$16)","v":0},{"$f":"COUNTIFS(InputArea,\"=\"&List!$B$2,InputTopic,\"=\"&List!$E2,InputMode,\"=\"&List!$A$17)","v":0},{"$f":"COUNTIFS(InputArea,\"=\"&List!$B$2,InputTopic,\"=\"&List!$E2,InputMode,\"=\"&List!$A$18)","v":0},{"$f":"COUNTIFS(InputArea,\"=\"&List!$B$2,InputTopic,\"=\"&List!$E2,InputMode,\"=\"&List!$A$19)","v":0},{"$f":"SUMIFS(InputHours,InputArea,\"=\"&List!$B$2,InputTopic,\"=\"&List!$E2,InputMode,\"=\"&List!$A$14)","v":0},{"$f":"SUMIFS(InputHours,InputArea,\"=\"&List!$B$2,InputTopic,\"=\"&List!$E2,InputMode,\"=\"&List!$A$15)","v":0},{"$f":"SUMIFS(InputHours,InputArea,\"=\"&List!$B$2,InputTopic,\"=\"&List!$E2,InputMode,\"=\"&List!$A$16)","v":0},{"$f":"SUMIFS(InputHours,InputArea,\"=\"&List!$B$2,InputTopic,\"=\"&List!$E2,InputMode,\"=\"&List!$A$17)","v":0},{"$f":"SUMIFS(InputHours,InputArea,\"=\"&List!$B$2,InputTopic,\"=\"&List!$E2,InputMode,\"=\"&List!$A$18)","v":0},{"$f":"SUMIFS(InputHours,InputArea,\"=\"&List!$B$2,InputTopic,\"=\"&List!$E2,InputMode,\"=\"&List!$A$19)","v":0},{"$f":"COUNTIFS(InputArea,\"=\"&List!$B$2,InputTopic,\"=\"&List!$E2,InputLevel,\"=\"&Input!$A$5)","v":0},{"$f":"COUNTIFS(InputArea,\"=\"&List!$B$2,InputTopic,\"=\"&List!$E2,InputLevel,\"=\"&Input!$A$4)","v":0},{"$f":"COUNTIFS(InputArea,\"=\"&List!$B$2,InputTopic,\"=\"&List!$E2,InputLevel,\"=\"&Input!$A$3)","v":0},{"$f":"COUNTIFS(InputArea,\"=\"&List!$B$2,InputTopic,\"=\"&List!$E2,InputLevel,\"=\"&Input!$A$2)","v":0},{"$f":"COUNTIFS(InputArea,\"=\"&List!$B$2,InputTopic,\"=\"&List!$E2,InputImportance,\"=\"&Input!$E$5)","v":0},{"$f":"COUNTIFS(InputArea,\"=\"&List!$B$2,InputTopic,\"=\"&List!$E2,InputImportance,\"=\"&Input!$E$4)","v":0},{"$f":"COUNTIFS(InputArea,\"=\"&List!$B$2,InputTopic,\"=\"&List!$E2,InputImportance,\"=\"&Input!$E$3)","v":0},{"$f":"COUNTIFS(InputArea,\"=\"&List!$B$2,InputTopic,\"=\"&List!$E2,InputImportance,\"=\"&Input!$E$2)","v":0},{"$f":"COUNTIFS(InputArea,\"=\"&List!$B$2,InputTopic,\"=\"&List!$E2,InputSkill,\"=\"&List!$D$14)","v":0},{"$f":"COUNTIFS(InputArea,\"=\"&List!$B$2,InputTopic,\"=\"&List!$E2,InputSkill,\"=\"&List!$D$15)","v":0},{"$f":"COUNTIFS(InputArea,\"=\"&List!$B$2,InputTopic,\"=\"&List!$E2,InputSkill,\"=\"&List!$D$16)","v":0},{"$f":"COUNTIFS(InputArea,\"=\"&List!$B$2,InputTopic,\"=\"&List!$E2,InputSkill,\"=\"&List!$D$17)","v":0},{"$f":"COUNTIFS(InputArea,\"=\"&List!$B$2,InputTopic,\"=\"&List!$E2,InputSkill,\"=\"&List!$D$18)","v":0},{"$f":"COUNTIFS(InputArea,\"=\"&List!$B$2,InputTopic,\"=\"&List!$E2,InputSkill,\"=\"&List!$D$19)","v":0},{"$f":"SUM(G3:L3)","v":0},{"$f":"SUM(M3:R3)","v":0},{"$f":"IFERROR(((W3*$W$2)+(X3*$X$2)+(Y3*$Y$2)+(Z3*$Z$2))/AG3,0)","v":{"v":0,"d":"0.00"}},{"$f":"IFERROR(AH3/AG3,0)","v":{"v":0,"d":"0.0"}},{"$f":"SUM(G3:G42)","v":0},{"$f":"SUM(H3:H42)","v":0},0,0,0,0,0,0,0,0,0,0,{"$f":"SUM(AA3:AA42)","v":0},{"$f":"SUM(AB3:AB42)","v":0},0,0,0,0,{"$f":"SUM(S3:S42)","v":0},{"$f":"SUM(T3:T42)","v":0},0,0,{"$f":"SUM(AK3:AP42)","v":0},{"$f":"SUM(AQ3:AV42)","v":0}]
["F","T","Geo",null,"Earth","Model",{"$f":"COUNTIFS(InputArea,\"=\"&List!$B$2,InputTopic,\"=\"&List!$E3,InputMode,\"=\"&List!$A$14)","v":0},{"$f":"COUNTIFS(InputArea,\"=\"&List!$B$2,InputTopic,\"=\"&List!$E3,InputMode,\"=\"&List!$A$15)","v":0},{"$f":"COUNTIFS(InputArea,\"=\"&List!$B$2,InputTopic,\"=\"&List!$E3,InputMode,\"=\"&List!$A$16)","v":0},{"$f":"COUNTIFS(InputArea,\"=\"&List!$B$2,InputTopic,\"=\"&List!$E3,InputMode,\"=\"&List!$A$17)","v":0},{"$f":"COUNTIFS(InputArea,\"=\"&List!$B$2,InputTopic,\"=\"&List!$E3,InputMode,\"=\"&List!$A$18)","v":0},{"$f":"COUNTIFS(InputArea,\"=\"&List!$B$2,InputTopic,\"=\"&List!$E3,InputMode,\"=\"&List!$A$19)","v":0},{"$f":"SUMIFS(InputHours,InputArea,\"=\"&List!$B$2,InputTopic,\"=\"&List!$E3,InputMode,\"=\"&List!$A$14)","v":0},{"$f":"SUMIFS(InputHours,InputArea,\"=\"&List!$B$2,InputTopic,\"=\"&List!$E3,InputMode,\"=\"&List!$A$15)","v":0},{"$f":"SUMIFS(InputHours,InputArea,\"=\"&List!$B$2,InputTopic,\"=\"&List!$E3,InputMode,\"=\"&List!$A$16)","v":0},{"$f":"SUMIFS(InputHours,InputArea,\"=\"&List!$B$2,InputTopic,\"=\"&List!$E3,InputMode,\"=\"&List!$A$17)","v":0},{"$f":"SUMIFS(InputHours,InputArea,\"=\"&List!$B$2,InputTopic,\"=\"&List!$E3,InputMode,\"=\"&List!$A$18)","v":0},{"$f":"SUMIFS(InputHours,InputArea,\"=\"&List!$B$2,InputTopic,\"=\"&List!$E3,InputMode,\"=\"&List!$A$19)","v":0},{"$f":"COUNTIFS(InputArea,\"=\"&List!$B$2,InputTopic,\"=\"&List!$E3,InputLevel,\"=\"&Input!$A$5)","v":0},{"$f":"COUNTIFS(InputArea,\"=\"&List!$B$2,InputTopic,\"=\"&List!$E3,InputLevel,\"=\"&Input!$A$4)","v":0},{"$f":"COUNTIFS(InputArea,\"=\"&List!$B$2,InputTopic,\"=\"&List!$E3,InputLevel,\"=\"&Input!$A$3)","v":0},{"$f":"COUNTIFS(InputArea,\"=\"&List!$B$2,InputTopic,\"=\"&List!$E3,InputLevel,\"=\"&Input!$A$2)","v":0},{"$f":"COUNTIFS(InputArea,\"=\"&List!$B$2,InputTopic,\"=\"&List!$E3,InputImportance,\"=\"&Input!$E$5)","v":0},{"$f":"COUNTIFS(InputArea,\"=\"&List!$B$2,InputTopic,\"=\"&List!$E3,InputImportance,\"=\"&Input!$E$4)","v":0},{"$f":"COUNTIFS(InputArea,\"=\"&List!$B$2,InputTopic,\"=\"&List!$E3,InputImportance,\"=\"&Input!$E$3)","v":0},{"$f":"COUNTIFS(InputArea,\"=\"&List!$B$2,InputTopic,\"=\"&List!$E3,InputImportance,\"=\"&Input!$E$2)","v":0},{"$f":"COUNTIFS(InputArea,\"=\"&List!$B$2,InputTopic,\"=\"&List!$E3,InputSkill,\"=\"&List!$D$14)","v":0},{"$f":"COUNTIFS(InputArea,\"=\"&List!$B$2,InputTopic,\"=\"&List!$E3,InputSkill,\"=\"&List!$D$15)","v":0},{"$f":"COUNTIFS(InputArea,\"=\"&List!$B$2,InputTopic,\"=\"&List!$E3,InputSkill,\"=\"&List!$D$16)","v":0},{"$f":"COUNTIFS(InputArea,\"=\"&List!$B$2,InputTopic,\"=\"&List!$E3,InputSkill,\"=\"&List!$D$17)","v":0},{"$f":"COUNTIFS(InputArea,\"=\"&List!$B$2,InputTopic,\"=\"&List!$E3,InputSkill,\"=\"&List!$D$18)","v":0},{"$f":"COUNTIFS(InputArea,\"=\"&List!$B$2,InputTopic,\"=\"&List!$E3,InputSkill,\"=\"&List!$D$19)","v":0},{"$f":"SUM(G4:L4)","v":0},{"$f":"SUM(M4:R4)","v":0},{"$f":"IFERROR(((W4*$W$2)+(X4*$X$2)+(Y4*$Y$2)+(Z4*$Z$2))/AG4,0)","v":{"v":0,"d":"0.00"}},{"$f":"IFERROR(AH4/AG4,0)","v":{"v":0,"d":"0.0"}}]
["F","T","Geo",null,"Earth","Others",{"$f":"COUNTIFS(InputArea,\"=\"&List!$B$2,InputTopic,\"=\"&List!$E4,InputMode,\"=\"&List!$A$14)","v":0},{"$f":"COUNTIFS(InputArea,\"=\"&List!$B$2,InputTopic,\"=\"&List!$E4,InputMode,\"=\"&List!$A$15)","v":0},{"$f":"COUNTIFS(InputArea,\"=\"&List!$B$2,InputTopic,\"=\"&List!$E4,InputMode,\"=\"&List!$A$16)","v":0},{"$f":"COUNTIFS(InputArea,\"=\"&List!$B$2,InputTopic,\"=\"&List!$E4,InputMode,\"=\"&List!$A$17)","v":0},{"$f":"COUNTIFS(InputArea,\"=\"&List!$B$2,InputTopic,\"=\"&List!$E4,InputMode,\"=\"&List!$A$18)","v":0},{"$f":"COUNTIFS(InputArea,\"=\"&List!$B$2,InputTopic,\"=\"&List!$E4,InputMode,\"=\"&List!$A$19)","v":0},{"$f":"SUMIFS(InputHours,InputArea,\"=\"&List!$B$2,InputTopic,\"=\"&List!$E4,InputMode,\"=\"&List!$A$14)","v":0},{"$f":"SUMIFS(InputHours,InputArea,\"=\"&List!$B$2,InputTopic,\"=\"&List!$E4,InputMode,\"=\"&List!$A$15)","v":0},{"$f":"SUMIFS(InputHours,InputArea,\"=\"&List!$B$2,InputTopic,\"=\"&List!$E4,InputMode,\"=\"&List!$A$16)","v":0},{"$f":"SUMIFS(InputHours,InputArea,\"=\"&List!$B$2,InputTopic,\"=\"&List!$E4,InputMode,\"=\"&List!$A$17)","v":0},{"$f":"SUMIFS(InputHours,InputArea,\"=\"&List!$B$2,InputTopic,\"=\"&List!$E4,InputMode,\"=\"&List!$A$18)","v":0},{"$f":"SUMIFS(InputHours,InputArea,\"=\"&List!$B$2,InputTopic,\"=\"&List!$E4,InputMode,\"=\"&List!$A$19)","v":0},{"$f":"COUNTIFS(InputArea,\"=\"&List!$B$2,InputTopic,\"=\"&List!$E4,InputLevel,\"=\"&Input!$A$5)","v":0},{"$f":"COUNTIFS(InputArea,\"=\"&List!$B$2,InputTopic,\"=\"&List!$E4,InputLevel,\"=\"&Input!$A$4)","v":0},{"$f":"COUNTIFS(InputArea,\"=\"&List!$B$2,InputTopic,\"=\"&List!$E4,InputLevel,\"=\"&Input!$A$3)","v":0},{"$f":"COUNTIFS(InputArea,\"=\"&List!$B$2,InputTopic,\"=\"&List!$E4,InputLevel,\"=\"&Input!$A$2)","v":0},{"$f":"COUNTIFS(InputArea,\"=\"&List!$B$2,InputTopic,\"=\"&List!$E4,InputImportance,\"=\"&Input!$E$5)","v":0},{"$f":"COUNTIFS(InputArea,\"=\"&List!$B$2,InputTopic,\"=\"&List!$E4,InputImportance,\"=\"&Input!$E$4)","v":0},{"$f":"COUNTIFS(InputArea,\"=\"&List!$B$2,InputTopic,\"=\"&List!$E4,InputImportance,\"=\"&Input!$E$3)","v":0},{"$f":"COUNTIFS(InputArea,\"=\"&List!$B$2,InputTopic,\"=\"&List!$E4,InputImportance,\"=\"&Input!$E$2)","v":0},{"$f":"COUNTIFS(InputArea,\"=\"&List!$B$2,InputTopic,\"=\"&List!$E4,InputSkill,\"=\"&List!$D$14)","v":0},{"$f":"COUNTIFS(InputArea,\"=\"&List!$B$2,InputTopic,\"=\"&List!$E4,InputSkill,\"=\"&List!$D$15)","v":0},{"$f":"COUNTIFS(InputArea,\"=\"&List!$B$2,InputTopic,\"=\"&List!$E4,InputSkill,\"=\"&List!$D$16)","v":0},{"$f":"COUNTIFS(InputArea,\"=\"&List!$B$2,InputTopic,\"=\"&List!$E4,InputSkill,\"=\"&List!$D$17)","v":0},{"$f":"COUNTIFS(InputArea,\"=\"&List!$B$2,InputTopic,\"=\"&List!$E4,InputSkill,\"=\"&List!$D$18)","v":0},{"$f":"COUNTIFS(InputArea,\"=\"&List!$B$2,InputTopic,\"=\"&List!$E4,InputSkill,\"=\"&List!$D$19)","v":0},0,0,{"v":0,"d":"0.00"},{"v":0,"d":"0.0"}]
["F","T U","Geo","FOUNDATION","CoordinateSystems","Direction",{"$f":"COUNTIFS(InputArea,\"=\"&List!$B$3,InputTopic,\"=\"&List!$F2,InputMode,\"=\"&List!$A$14)","v":0},{"$f":"COUNTIFS(InputArea,\"=\"&List!$B$3,InputTopic,\"=\"&List!$F2,InputMode,\"=\"&List!$A$15)","v":0},{"$f":"COUNTIFS(InputArea,\"=\"&List!$B$3,InputTopic,\"=\"&List!$F2,InputMode,\"=\"&List!$A$16)","v":0},{"$f":"COUNTIFS(InputArea,\"=\"&List!$B$3,InputTopic,\"=\"&List!$F2,InputMode,\"=\"&List!$A$17)","v":0},{"$f":"COUNTIFS(InputArea,\"=\"&List!$B$3,InputTopic,\"=\"&List!$F2,InputMode,\"=\"&List!$A$18)","v":0},{"$f":"COUNTIFS(InputArea,\"=\"&List!$B$3,InputTopic,\"=\"&List!$F2,InputMode,\"=\"&List!$A$19)","v":0},{"$f":"SUMIFS(InputHours,InputArea,\"=\"&List!$B$3,InputTopic,\"=\"&List!$F2,InputMode,\"=\"&List!$A$14)","v":0},{"$f":"SUMIFS(InputHours,InputArea,\"=\"&List!$B$3,InputTopic,\"=\"&List!$F2,InputMode,\"=\"&List!$A$15)","v":0},{"$f":"SUMIFS(InputHours,InputArea,\"=\"&List!$B$3,InputTopic,\"=\"&List!$F2,InputMode,\"=\"&List!$A$16)","v":0},{"$f":"SUMIFS(InputHours,InputArea,\"=\"&List!$B$3,InputTopic,\"=\"&List!$F2,InputMode,\"=\"&List!$A$17)","v":0},{"$f":"SUMIFS(InputHours,InputArea,\"=\"&List!$B$3,InputTopic,\"=\"&List!$F2,InputMode,\"=\"&List!$A$18)","v":0},{"$f":"SUMIFS(InputHours,InputArea,\"=\"&List!$B$3,InputTopic,\"=\"&List!$F2,InputMode,\"=\"&List!$A$19)","v":0},{"$f":"COUNTIFS(InputArea,\"=\"&List!$B$3,InputTopic,\"=\"&List!$F2,InputLevel,\"=\"&Input!$A$5)","v":0},{"$f":"COUNTIFS(InputArea,\"=\"&List!$B$3,InputTopic,\"=\"&List!$F2,InputLevel,\"=\"&Input!$A$4)","v":0},{"$f":"COUNTIFS(InputArea,\"=\"&List!$B$3,InputTopic,\"=\"&List!$F2,InputLevel,\"=\"&Input!$A$3)","v":0},{"$f":"COUNTIFS(InputArea,\"=\"&List!$B$3,InputTopic,\"=\"&List!$F2,InputLevel,\"=\"&Input!$A$2)","v":0},{"$f":"COUNTIFS(InputArea,\"=\"&List!$B$3,InputTopic,\"=\"&List!$F2,InputImportance,\"=\"&Input!$E$5)","v":0},{"$f":"COUNTIFS(InputArea,\"=\"&List!$B$3,InputTopic,\"=\"&List!$F2,InputImportance,\"=\"&Input!$E$4)","v":0},{"$f":"COUNTIFS(InputArea,\"=\"&List!$B$3,InputTopic,\"=\"&List!$F2,InputImportance,\"=\"&Input!$E$3)","v":0},{"$f":"COUNTIFS(InputArea,\"=\"&List!$B$3,InputTopic,\"=\"&List!$F2,InputImportance,\"=\"&Input!$E$2)","v":0},{"$f":"COUNTIFS(InputArea,\"=\"&List!$B$3,InputTopic,\"=\"&List!$F2,InputSkill,\"=\"&List!$D$14)","v":0},{"$f":"COUNTIFS(InputArea,\"=\"&List!$B$3,InputTopic,\"=\"&List!$F2,InputSkill,\"=\"&List!$D$15)","v":0},{"$f":"COUNTIFS(InputArea,\"=\"&List!$B$3,InputTopic,\"=\"&List!$F2,InputSkill,\"=\"&List!$D$16)","v":0},{"$f":"COUNTIFS(InputArea,\"=\"&List!$B$3,InputTopic,\"=\"&List!$F2,InputSkill,\"=\"&List!$D$17)","v":0},{"$f":"COUNTIFS(InputArea,\"=\"&List!$B$3,InputTopic,\"=\"&List!$F2,InputSkill,\"=\"&List!$D$18)","v":0},{"$f":"COUNTIFS(InputArea,\"=\"&List!$B$3,InputTopic,\"=\"&List!$F2,InputSkill,\"=\"&List!$D$19)","v":0},{"$f":"SUM(G6:L6)","v":0},{"$f":"SUM(M6:R6)","v":0},{"v":0,"d":"0.00"},{"v":0,"d":"0.0"}]
{"$rows_left_out":131}
{"sheet":"ICalc02","index":3,"n_rows":22,"n_cols":12,"rows_kept":22,"hidden":true}
[null,"Geospatial","Generic","Geo-Gen","SUM",null,"Technical","User"]
["Foundation",{"$f":"COUNTIFS(CalcRank,\"=F\",CalcGeo, \"=Geo\",ICalc01!AG3:AG112,\"<>0\")","v":0},{"$f":"COUNTIFS(CalcRank,\"=F\",CalcGeo, \"=Gen\",ICalc01!AG3:AG112,\"<>0\")","v":0},{"$f":"B2-C2","v":0},{"$f":"SUM(B2:C2)","v":0},null,{"$f":"COUNTIFS(CalcRank,\"=F\",CalcTech, \"=T\",ICalc01!AG3:AG112,\"<>0\")","v":0},{"$f":"COUNTIFS(CalcRank,\"=F\",CalcTech, \"=U\",ICalc01!AG3:AG112,\"<>0\")","v":0}]
["Core",{"$f":"COUNTIFS(CalcRank,\"=C\",CalcGeo, \"=Geo\",ICalc01!AG3:AG112,\"<>0\")","v":0},{"$f":"COUNTIFS(CalcRank,\"=C\",CalcGeo, \"=Gen\",ICalc01!AG3:AG112,\"<>0\")","v":0},{"$f":"B3-C3","v":0},{"$f":"SUM(B3:C3)","v":0},null,{"$f":"COUNTIFS(CalcRank,\"=C\",CalcTech, \"=T\",ICalc01!AG3:AG112,\"<>0\")","v":0},{"$f":"COUNTIFS(CalcRank,\"=C\",CalcTech, \"=U\",ICalc01!AG3:AG112,\"<>0\")","v":0}]
["Specialized",{"$f":"COUNTIFS(CalcRank,\"=S\",CalcGeo, \"=Geo\",ICalc01!AG3:AG112,\"<>0\")","v":0},{"$f":"COUNTIFS(CalcRank,\"=S\",CalcGeo, \"=Gen\",ICalc01!AG3:AG112,\"<>0\")","v":0},0,0,null,{"$f":"COUNTIFS(CalcRank,\"=S\",CalcTech, \"=T\",ICalc01!AG3:AG112,\"<>0\")","v":0},{"$f":"COUNTIFS(CalcRank,\"=S\",CalcTech, \"=U\",ICalc01!AG3:AG112,\"<>0\")","v":0}]
["Overall",{"$f":"COUNTIFS(CalcGeo, \"=Geo\",ICalc01!AG3:AG112,\"<>0\")","v":0},{"$f":"COUNTIFS(CalcGeo, \"=Gen\",ICalc01!AG3:AG112,\"<>0\")","v":0},0,0,null,{"$f":"COUNTIFS(CalcTech, \"=T\",ICalc01!AG3:AG112,\"<>0\")","v":0},{"$f":"COUNTIFS(CalcTech, \"=U\",ICalc01!AG3:AG112,\"<>0\")","v":0},{"$f":"G5-H5","v":0}]
[{"$nulls":7},"SUM",{"$f":"SUM(G5:H5)","v":0}]
{"$rows_left_out":17}
{"sheet":"OutputDiagnosis","index":4,"n_rows":67,"n_cols":12,"rows_kept":67,"merged":[[1,4,1,11],[2,1,2,2],[28,1,28,11],[42,1,42,11],[54,2,54,3],[54,6,54,9],[54,10,54,11],[55,2,55,3],[55,6,55,9],[55,10,55,11]]}
[]
[null,"Subject/Course",null,null,"Taught Knowledge"]
[null,{"$f":"IF(ISBLANK(SubjectCourse), \"-\", SubjectCourse)","v":"-"}]
[]
[null,"Average Level of Understanding"]
[null,{"$f":"IF(SUM(ICalc01!S114:V114)=0, \"-\", IF(AND((SUM(ICalc01!U114:V114)>SUM(ICalc01!T114:U114)),(SUM(ICalc01!U114:V114)>=SUM(ICalc01!S114:T114))),\"Advanced\",IF(AND((SUM(ICalc01!T114:U114)>=SUM(ICalc01!U114:V114)),SUM(ICalc01!T114:U114)>=SUM(ICalc01!S114:T114)),\"Intermediate\",\"Introductory\")))","v":"-"}]
{"$rows_left_out":42}